No changes between runs

md$ python test_kernel.py TestWarehouseExecMovementAPI
F........
Ran 9 tests in 5.293s
FAILED (failures=1)

md$ python test_kernel.py TestWarehouseExecMovementAPI
..F...F..
Ran 9 tests in 3.489s
FAILED (failures=2)

md$ python test_kernel.py TestWarehouseExecMovementAPI 
.........
Ran 9 tests in 3.003s
OK

md$ python test_kernel.py TestWarehouseExecMovementAPI
.....F...
Ran 9 tests in 2.849s
FAILED (failures=1)

md$ python test_kernel.py TestWarehouseExecMovementAPI
F........
Ran 9 tests in 2.900s
FAILED (failures=1)

Kommentar verfassen

Trage deine Daten unten ein oder klicke ein Icon um dich einzuloggen:

WordPress.com-Logo

Du kommentierst mit Deinem WordPress.com-Konto. Abmelden / Ändern )

Twitter-Bild

Du kommentierst mit Deinem Twitter-Konto. Abmelden / Ändern )

Facebook-Foto

Du kommentierst mit Deinem Facebook-Konto. Abmelden / Ändern )

Google+ Foto

Du kommentierst mit Deinem Google+-Konto. Abmelden / Ändern )

Verbinde mit %s